APIInterfacesCOMPILATION_FAILEDVersion: 6.23.1On this pageInterface: COMPILATION_FAILEDAPI.Errors.COMPILATION_FAILEDProperties​code​• code: 56Defined in​node_modules/starknet-types-07/dist/types/api/errors.d.ts:97message​• message: "Compilation failed"Defined in​node_modules/starknet-types-07/dist/types/api/errors.d.ts:98